To honour the JVM settings for this build a single-use Daemon process will be forked. For more on this, please refer to https://docs.gradle.org/9.1.0/userguide/gradle_daemon.html#sec:disabling_the_daemon in the Gradle documentation. Daemon will be stopped at the end of the build > Task :app:preBuild UP-TO-DATE > Task :app:preDebugBuild UP-TO-DATE > Task :app:generateDebugResources UP-TO-DATE > Task :app:packageDebugResources UP-TO-DATE > Task :app:processDebugNavigationResources UP-TO-DATE > Task :app:parseDebugLocalResources UP-TO-DATE > Task :app:generateDebugRFile UP-TO-DATE > Task :app:compileDebugKotlin ./gradlew : e: file:/// C:/Users/dlnko/AndroidS tudioProjects/RiseNow/a pp/src/main/java/com/si mats/risenow/ui/screens /LoginScreen.kt:218:52 No value passed for parameter 'identity'. At line:1 char:1 + ./gradlew :app:compil eDebugKotlin --no-daemon > build_log_3.txt 2>&1 + ~~~~~~~~~~~~~~~~~~~~~ ~~~~~~~~~~~~~~~~~~~~~~~ ~~~~~~~~~~~~~~~~~~~~~~~ ~ + CategoryInfo : NotSpecifi ed: (e: file:///C: /U...ter 'identity '.:String) [], Rem oteException + FullyQualifiedEr rorId : NativeComm andError e: file:///C:/Users/dln ko/AndroidStudioProject s/RiseNow/app/src/main/ java/com/simats/risenow /ui/screens/LoginScreen .kt:218:52 No value passed for parameter 'statement'. > Task :app:compileDebugKotlin FAILED FAILURE: Build failed with an exception. * What went wrong: Execution failed for task ':app:compileDebug Kotlin'. > A failure occurred while executing org.jet brains.kotlin.compilerR unner.GradleCompilerRun nerWithWorkers$GradleKo tlinCompilerWorkAction > Compilation error. See log for more details * Try: > Run with --stacktrace option to get the stack trace. > Run with --info or --debug option to get more log output. > Run with --scan to generate a Build Scan (Powered by Develocity). > Get more help at http s://help.gradle.org. BUILD FAILED in 32s 6 actionable tasks: 1 executed, 5 up-to-date